Target
Glutamate receptor ionotropic, kainate 2
Ligand
BDBM50166287
Substrate
Meas. Tech.
ChEMBL_435007 (CHEMBL920258)
Ki
>100±n/a nM
Citation
 Vogensen, SBFrydenvang, KGreenwood, JRPostorino, GNielsen, BPickering, DSEbert, BBølcho, UEgebjerg, JGajhede, MKastrup, JSJohansen, TNClausen, RPKrogsgaard-Larsen, P A tetrazolyl-substituted subtype-selective AMPA receptor agonist. J Med Chem 50:2408-14 (2007)  
Target
Name:
Glutamate receptor ionotropic, kainate 2
Synonyms:
GRIK2_RAT Glutamate receptor ionotropic kainate 2 Ionotropic glutamate receptor kainate 2/5
Type:
PROTEIN
Mol. Mass.:
102478.61
Organism:
Rattus norvegicus
Description:
ChEMBL_936439
Residue:
908
  
Inhibitor
Name:
BDBM50166287
Synonyms:
(RS)-2-amino-3-[3-hydroxy-5-(2-isopropyl-2H-5-tetrazolyl)-4-isoxazolyl]propionic acid 2-amino-3-(3-hydroxy-5-(2-isopropyl-2H-tetrazol-5-yl)isoxazol-4-yl)propanoic acid | CHEMBL193087
Type:
Small organic molecule
Emp. Form.:
C10H14N6O4
Mol. Mass.:
282.256
SMILES:
CC(C)n1nnc(n1)-c1o[nH]c(=O)c1CC(N)C(O)=O
: