Target
Polyunsaturated fatty acid 5-lipoxygenase
Ligand
BDBM50211483
Substrate
Meas. Tech.
ChEMBL_436352 (CHEMBL905752)
IC50
900±n/a nM
Citation
 Franke, LSchwarz, OMüller-Kuhrt, LHoernig, CFischer, LGeorge, STanrikulu, YSchneider, PWerz, OSteinhilber, DSchneider, G Identification of natural-product-derived inhibitors of 5-lipoxygenase activity by ligand-based virtual screening. J Med Chem 50:2640-6 (2007)  
Target
Name:
Polyunsaturated fatty acid 5-lipoxygenase
Synonyms:
5-LO 5-Lipoxygenase (5-LO) 5-Lipoygenase ALOX5 LOG5 | LOX5_HUMAN
Type:
Enzyme
Mol. Mass.:
77972.74
Organism:
Homo sapiens (Human)
Description:
Recombinant protein was purified from E. coli lysate. After ammonium sulfate precipitation and subsequent steps, the supernatant (S100) was used for 5-LO activity assay.
Residue:
674
  
Inhibitor
Name:
BDBM50211483
Synonyms:
3,4,5-trimethoxy-N-(3,5a,10-trimethyl-2-oxo-2,3,3a,4,5,5a,6,10,10a,10b-decahydro-1-oxa-7-thia-9-aza-dicyclopenta[a,g]naphthalen-8-yl)-benzamide | CHEMBL375676
Type:
Small organic molecule
Emp. Form.:
C26H32N2O6S
Mol. Mass.:
500.607
SMILES:
COc1cc(cc(OC)c1OC)C(=O)Nc1nc2[C@@H](C)[C@@H]3[C@H]4OC(=O)[C@@H](C)[C@@H]4CC[C@@]3(C)Cc2s1
: