Target
Delta-type opioid receptor
Ligand
BDBM50212292
Substrate
Meas. Tech.
ChEMBL_436576 (CHEMBL904884)
Ki
1.5±n/a nM
Citation
 Zhang, ALi, FDing, CYao, QKnapp, BIBidlack, JMNeumeyer, JL Synthesis and pharmacological evaluation of 6,7-indolo/thiazolo-morphinans--further SAR of levorphanol. J Med Chem 50:2747-51 (2007)  
Target
Name:
Delta-type opioid receptor
Synonyms:
D-OR-1 Delta opioid receptor OPIATE Delta OPRD1 OPRK1 | opioid receptor, delta 1
Type:
G Protein-Coupled Receptor (GPCR)
Mol. Mass.:
40382.98
Organism:
Homo sapiens (Human)
Description:
Competition binding assays were carried out using membrane preparations from transfected HN9.10 cells that constitutively expressed the delta opioid receptor.
Residue:
372
  
Inhibitor
Name:
BDBM50212292
Synonyms:
(1S,13R,14R)-24-(cyclopropylmethyl)-19-methoxy-4,24-diazahexacyclo[12.7.3.0^{1,13}.0^{3,11}.0^{5,10}.0^{16,21}]tetracosa-3(11),5(10),6,8,16(21),17,19-heptaene | CHEMBL226113
Type:
Small organic molecule
Emp. Form.:
C27H30N2O
Mol. Mass.:
398.5399
SMILES:
COc1ccc2C[C@@H]3[C@@H]4Cc5c(C[C@]4(CCN3CC3CC3)c2c1)[nH]c1ccccc51
: