Target
Mu-type opioid receptor
Ligand
BDBM50212293
Substrate
Meas. Tech.
ChEMBL_436580 (CHEMBL904888)
EC50
0.400000±n/a nM
Citation
 Zhang, ALi, FDing, CYao, QKnapp, BIBidlack, JMNeumeyer, JL Synthesis and pharmacological evaluation of 6,7-indolo/thiazolo-morphinans--further SAR of levorphanol. J Med Chem 50:2747-51 (2007)  
Target
Name:
Mu-type opioid receptor
Synonyms:
M-OR-1 MOR-1 MUOR1 Mu opiate receptor OPRM1 hMOP | mu-type opioid receptor isoform MOR-1
Type:
G Protein-Coupled Receptor (GPCR)
Mol. Mass.:
44789.51
Organism:
Homo sapiens (Human)
Description:
P35372
Residue:
400
  
Inhibitor
Name:
BDBM50212293
Synonyms:
(1S,9R,10R)-5-amino-20-(cyclopropylmethyl)-6-thia-4,20-diazapentacyclo[8.7.3.0^{1,9}.0^{3,7}.0^{12,17}]icosa-3(7),4,12(17),13,15-pentaen-15-ol | CHEMBL226217
Type:
Small organic molecule
Emp. Form.:
C21H25N3OS
Mol. Mass.:
367.508
SMILES:
Nc1nc2C[C@]34CCN(CC5CC5)[C@H](Cc5ccc(O)cc35)[C@@H]4Cc2s1
: