Target
Mu-type opioid receptor
Ligand
BDBM50212292
Substrate
Meas. Tech.
ChEMBL_436580 (CHEMBL904888)
EC50
1.7±n/a nM
Citation
 Zhang, ALi, FDing, CYao, QKnapp, BIBidlack, JMNeumeyer, JL Synthesis and pharmacological evaluation of 6,7-indolo/thiazolo-morphinans--further SAR of levorphanol. J Med Chem 50:2747-51 (2007)  
Target
Name:
Mu-type opioid receptor
Synonyms:
M-OR-1 MOR-1 MUOR1 Mu opiate receptor OPRM1 hMOP | mu-type opioid receptor isoform MOR-1
Type:
G Protein-Coupled Receptor (GPCR)
Mol. Mass.:
44789.51
Organism:
Homo sapiens (Human)
Description:
P35372
Residue:
400
  
Inhibitor
Name:
BDBM50212292
Synonyms:
(1S,13R,14R)-24-(cyclopropylmethyl)-19-methoxy-4,24-diazahexacyclo[12.7.3.0^{1,13}.0^{3,11}.0^{5,10}.0^{16,21}]tetracosa-3(11),5(10),6,8,16(21),17,19-heptaene | CHEMBL226113
Type:
Small organic molecule
Emp. Form.:
C27H30N2O
Mol. Mass.:
398.5399
SMILES:
COc1ccc2C[C@@H]3[C@@H]4Cc5c(C[C@]4(CCN3CC3CC3)c2c1)[nH]c1ccccc51
: