Target
Kappa-type opioid receptor
Ligand
BDBM50212295
Substrate
Meas. Tech.
ChEMBL_436577 (CHEMBL904885)
Ki
14±n/a nM
Citation
 Zhang, ALi, FDing, CYao, QKnapp, BIBidlack, JMNeumeyer, JL Synthesis and pharmacological evaluation of 6,7-indolo/thiazolo-morphinans--further SAR of levorphanol. J Med Chem 50:2747-51 (2007)  
Target
Name:
Kappa-type opioid receptor
Synonyms:
K-OR-1 Kappa-opioid receptor (KOR) Kappa-type opioid receptor (KOR) OPIATE Kappa OPRK1 kappa opioid receptor (KOR)
Type:
G Protein-Coupled Receptor (GPCR)
Mol. Mass.:
42648.76
Organism:
Homo sapiens (Human)
Description:
P41145
Residue:
380
  
Inhibitor
Name:
BDBM50212295
Synonyms:
(1S,13R,14R)-24-methyl-4,24-diazahexacyclo[12.7.3.0^{1,13}.0^{3,11}.0^{5,10}.0^{16,21}]tetracosa-3(11),5(10),6,8,16(21),17,19-heptaen-19-ol | CHEMBL226114
Type:
Small organic molecule
Emp. Form.:
C23H24N2O
Mol. Mass.:
344.4495
SMILES:
CN1CC[C@]23Cc4[nH]c5ccccc5c4C[C@H]2[C@H]1Cc1ccc(O)cc31
: