Target
Glutamate receptor ionotropic, NMDA 2B
Ligand
BDBM50124907
Substrate
Meas. Tech.
ChEMBL_455781 (CHEMBL887787)
IC50
47±n/a nM
Citation
 Nguyen, KTClaiborne, CFMcCauley, JALibby, BEClaremon, DABednar, RAMosser, SDGaul, SLConnolly, TMCondra, CLBednar, BStump, GLLynch, JJKoblan, KSLiverton, NJ Cyclic benzamidines as orally efficacious NR2B-selective NMDA receptor antagonists. Bioorg Med Chem Lett 17:3997-4000 (2007)  
Target
Name:
Glutamate receptor ionotropic, NMDA 2B
Synonyms:
GRIN2B Glutamate [NMDA] receptor subunit epsilon 2 N-methyl D-aspartate receptor subtype 2B NMDAR2B NR3 | hNR3
Type:
PROTEIN
Mol. Mass.:
166375.46
Organism:
Homo sapiens (Human)
Description:
ChEMBL_1438829
Residue:
1484
  
Inhibitor
Name:
BDBM50124907
Synonyms:
4-trifluoromethoxy-N-(2-trifluoromethyl-benzyl)-benzamidine | CHEMBL159279
Type:
Small organic molecule
Emp. Form.:
C16H12F6N2O
Mol. Mass.:
362.2697
SMILES:
NC(=NCc1ccccc1C(F)(F)F)c1ccc(OC(F)(F)F)cc1
: