Target
Fatty acid-binding protein 5
Ligand
BDBM50212875
Substrate
Meas. Tech.
ChEMBL_455935 (CHEMBL887936)
Ki
240±n/a nM
Citation
 Sulsky, RMagnin, DRHuang, YSimpkins, LTaunk, PPatel, MZhu, YStouch, TRBassolino-Klimas, DParker, RHarrity, TStoffel, RTaylor, DSLavoie, TBKish, KJacobson, BLSheriff, SAdam, LPEwing, WRRobl, JA Potent and selective biphenyl azole inhibitors of adipocyte fatty acid binding protein (aFABP). Bioorg Med Chem Lett 17:3511-5 (2007)  
Target
Name:
Fatty acid-binding protein 5
Synonyms:
FABP5 Fatty acid binding protein epidermal | Fatty acid-binding protein 5 (FABP5)
Type:
Enzyme
Mol. Mass.:
15164.79
Organism:
Homo sapiens (Human)
Description:
Q01469
Residue:
135
  
Inhibitor
Name:
BDBM50212875
Synonyms:
2'-(5-ethyl-3,4-diphenyl-pyrazol-1-yl)-biphenyl-3-carboxylic acid | CHEMBL394440
Type:
Small organic molecule
Emp. Form.:
C30H24N2O2
Mol. Mass.:
444.5238
SMILES:
CCc1c(c(nn1-c1ccccc1-c1cccc(c1)C(O)=O)-c1ccccc1)-c1ccccc1
: