Target
Fatty acid-binding protein 5
Ligand
BDBM50212885
Substrate
Meas. Tech.
ChEMBL_455935 (CHEMBL887936)
Ki
>2000±n/a nM
Citation
 Sulsky, RMagnin, DRHuang, YSimpkins, LTaunk, PPatel, MZhu, YStouch, TRBassolino-Klimas, DParker, RHarrity, TStoffel, RTaylor, DSLavoie, TBKish, KJacobson, BLSheriff, SAdam, LPEwing, WRRobl, JA Potent and selective biphenyl azole inhibitors of adipocyte fatty acid binding protein (aFABP). Bioorg Med Chem Lett 17:3511-5 (2007)  
Target
Name:
Fatty acid-binding protein 5
Synonyms:
FABP5 Fatty acid binding protein epidermal | Fatty acid-binding protein 5 (FABP5)
Type:
Enzyme
Mol. Mass.:
15164.79
Organism:
Homo sapiens (Human)
Description:
Q01469
Residue:
135
  
Inhibitor
Name:
BDBM50212885
Synonyms:
CHEMBL245282 | [2'-(1-methyl-4,5-diphenyl-1H-imidazol-2-yl)-biphenyl-3-ylamino]-acetic acid
Type:
Small organic molecule
Emp. Form.:
C30H25N3O2
Mol. Mass.:
459.5384
SMILES:
Cn1c(nc(c1-c1ccccc1)-c1ccccc1)-c1ccccc1-c1cccc(NCC(O)=O)c1
: