Target
Fatty acid-binding protein 5
Ligand
BDBM50212886
Substrate
Meas. Tech.
ChEMBL_455935 (CHEMBL887936)
Ki
290±n/a nM
Citation
 Sulsky, RMagnin, DRHuang, YSimpkins, LTaunk, PPatel, MZhu, YStouch, TRBassolino-Klimas, DParker, RHarrity, TStoffel, RTaylor, DSLavoie, TBKish, KJacobson, BLSheriff, SAdam, LPEwing, WRRobl, JA Potent and selective biphenyl azole inhibitors of adipocyte fatty acid binding protein (aFABP). Bioorg Med Chem Lett 17:3511-5 (2007)  
Target
Name:
Fatty acid-binding protein 5
Synonyms:
FABP5 Fatty acid binding protein epidermal | Fatty acid-binding protein 5 (FABP5)
Type:
Enzyme
Mol. Mass.:
15164.79
Organism:
Homo sapiens (Human)
Description:
Q01469
Residue:
135
  
Inhibitor
Name:
BDBM50212886
Synonyms:
CHEMBL247529 | [2'-(3-ethyl-4,5-diphenyl-furan-2-yl)-biphenyl-3-yloxy]-acetic acid
Type:
Small organic molecule
Emp. Form.:
C32H26O4
Mol. Mass.:
474.5464
SMILES:
CCc1c(oc(c1-c1ccccc1)-c1ccccc1)-c1ccccc1-c1cccc(OCC(O)=O)c1
: