Target
Fatty acid-binding protein 5
Ligand
BDBM50212876
Substrate
Meas. Tech.
ChEMBL_455935 (CHEMBL887936)
Ki
2±n/a nM
Citation
 Sulsky, RMagnin, DRHuang, YSimpkins, LTaunk, PPatel, MZhu, YStouch, TRBassolino-Klimas, DParker, RHarrity, TStoffel, RTaylor, DSLavoie, TBKish, KJacobson, BLSheriff, SAdam, LPEwing, WRRobl, JA Potent and selective biphenyl azole inhibitors of adipocyte fatty acid binding protein (aFABP). Bioorg Med Chem Lett 17:3511-5 (2007)  
Target
Name:
Fatty acid-binding protein 5
Synonyms:
FABP5 Fatty acid binding protein epidermal | Fatty acid-binding protein 5 (FABP5)
Type:
Enzyme
Mol. Mass.:
15164.79
Organism:
Homo sapiens (Human)
Description:
Q01469
Residue:
135
  
Inhibitor
Name:
BDBM50212876
Synonyms:
2,3-bis[(2,4-dichlorobenzyl)oxy]benzoic acid | CHEMBL247298
Type:
Small organic molecule
Emp. Form.:
C21H14Cl4O4
Mol. Mass.:
472.145
SMILES:
OC(=O)c1cccc(OCc2ccc(Cl)cc2Cl)c1OCc1ccc(Cl)cc1Cl
: