Target
Cytochrome P450 2D6
Ligand
BDBM50213744
Substrate
Meas. Tech.
ChEMBL_447519 (CHEMBL895418)
IC50
>25000±n/a nM
Citation
 Wang, YBusch-Petersen, JWang, FMa, LFu, WKerns, JKJin, JPalovich, MRShen, JKBurman, MFoley, JJSchmidt, DBHunsberger, GESarau, HMWiddowson, KL 3-Arylamino-2H-1,2,4-benzothiadiazin-5-ol 1,1-dioxides as novel and selective CXCR2 antagonists. Bioorg Med Chem Lett 17:3864-7 (2007)  
Target
Name:
Cytochrome P450 2D6
Synonyms:
CP2D6_HUMAN CYP2DL1 Cytochrome P450 2D6 (CYP2D6) P450-DB1
Type:
Protein
Mol. Mass.:
55774.82
Organism:
Homo sapiens (Human)
Description:
P10635
Residue:
497
  
Inhibitor
Name:
BDBM50213744
Synonyms:
3-(2-chloro-phenylamino)-7-nitro-1,1-dioxo-1,4-dihydro-1lambda6-benzo[1,2,4]thiadiazin-5-ol | CHEMBL231924
Type:
Small organic molecule
Emp. Form.:
C13H9ClN4O5S
Mol. Mass.:
368.752
SMILES:
Oc1cc(cc2c1N=C(Nc1ccccc1Cl)NS2(=O)=O)[N+]([O-])=O
: