Target
Purine nucleoside phosphorylase
Ligand
BDBM50214705
Substrate
Meas. Tech.
ChEMBL_447602 (CHEMBL896616)
IC50
20.2±n/a nM
Citation
 Hikishima, SHashimoto, MMagnowska, LBzowska, AYokomatsu, T Synthesis and biological evaluation of 9-deazaguanine derivatives connected by a linker to difluoromethylene phosphonic acid as multi-substrate analogue inhibitors of PNP. Bioorg Med Chem Lett 17:4173-7 (2007)  
Target
Name:
Purine nucleoside phosphorylase
Synonyms:
Inosine phosphorylase NP PNPH_HUMAN | Purine nucleoside phosphorylase (PNPase)
Type:
Enzyme
Mol. Mass.:
32119.53
Organism:
Homo sapiens (Human)
Description:
Residue:
289
  
Inhibitor
Name:
BDBM50214705
Synonyms:
5-(2-amino-6-oxo-1,6-dihydro-9H-purin-9-yl)-1,1-difluoropentylphosphonate 9-(5,5-DIFLUORO-5-PHOSPHONOPENTYL)GUANINE [5-(2-Amino-6-oxo-1,6-dihydro-purin-9-yl)-1,1-difluoro-pentyl]-phosphonic acid
Type:
Small organic molecule
Emp. Form.:
C10H14F2N5O4P
Mol. Mass.:
337.2198
SMILES:
Nc1nc2n(CCCCC(F)(F)P(O)(O)=O)cnc2c(=O)[nH]1
: