Target
Induced myeloid leukemia cell differentiation protein Mcl-1
Ligand
BDBM50214871
Substrate
Meas. Tech.
ChEMBL_439339 (CHEMBL888455)
Ki
18±n/a nM
Citation
 Tang, GDing, KNikolovska-Coleska, ZYang, CYQiu, SShangary, SWang, RGuo, JGao, WMeagher, JStuckey, JKrajewski, KJiang, SRoller, PPWang, S Structure-based design of flavonoid compounds as a new class of small-molecule inhibitors of the anti-apoptotic Bcl-2 proteins. J Med Chem 50:3163-6 (2007)  
Target
Name:
Induced myeloid leukemia cell differentiation protein Mcl-1
Synonyms:
BCL2L3 Bcl-2-like protein 3 (Mcl-1) Bcl2-L-3 MCL1 Mcl-1 Myeloid cell leukemia sequence 1 (BCL2-related) | mcl1/EAT
Type:
Membrane; Single-pass membrane protein
Mol. Mass.:
37332.87
Organism:
Homo sapiens (Human)
Description:
Q07820
Residue:
350
  
Inhibitor
Name:
BDBM50214871
Synonyms:
1,4-bis(5,6,7-trihydroxy-8-isobutyl-2-methyl-4-oxo-4H-chromen-3-yl)benzene | CHEMBL226578
Type:
Small organic molecule
Emp. Form.:
C34H34O10
Mol. Mass.:
602.6278
SMILES:
CC(C)Cc1c(O)c(O)c(O)c2c1oc(C)c(-c1ccc(cc1)-c1c(C)oc3c(CC(C)C)c(O)c(O)c(O)c3c1=O)c2=O
: