Target
Adenosine receptor A3
Ligand
BDBM50215109
Substrate
Meas. Tech.
ChEMBL_448188 (CHEMBL898448)
IC50
170±n/a nM
Citation
 Ravn, JQvortrup, KRosenbohm, CKoch, T Design, synthesis, and biological evaluation of LNA nucleosides as adenosine A3 receptor ligands. Bioorg Med Chem 15:5440-7 (2007)  
Target
Name:
Adenosine receptor A3
Synonyms:
A3 adenosine receptor (hA3) ADORA3 | Adenosine A3 receptor (A3AR)
Type:
G Protein-Coupled Receptor (GPCR)
Mol. Mass.:
36197.32
Organism:
Homo sapiens (Human)
Description:
P0DMS8
Residue:
318
  
Inhibitor
Name:
BDBM50215109
Synonyms:
(1R,3R,4R,7S)-(7-hydroxy-3-(adenin-9-yl)-2-oxa-5-azabicyclo[2:2:1]hept-1-yl)-N-methylcarboxamide | CHEMBL391279
Type:
Small organic molecule
Emp. Form.:
C12H15N7O3
Mol. Mass.:
305.2926
SMILES:
CNC(=O)[C@]12CN[C@H]([C@@H]1O)[C@@H](O2)n1cnc2c(N)ncnc12
: