Target
Gonadotropin-releasing hormone receptor
Ligand
BDBM50215175
Substrate
Meas. Tech.
ChEMBL_448200 (CHEMBL898460)
Ki
70±n/a nM
Citation
 Lanier, MCFeher, MAshweek, NJLoweth, CJRueter, JKSlee, DHWilliams, JPZhu, YFSullivan, SKBrown, MS Selection, synthesis, and structure-activity relationship of tetrahydropyrido[4,3-d]pyrimidine-2,4-diones as human GnRH receptor antagonists. Bioorg Med Chem 15:5590-603 (2007)  
Target
Name:
Gonadotropin-releasing hormone receptor
Synonyms:
GNRHR GRHR GnRH-R Gonadotropin-releasing hormone receptor | Gonadotropin-releasing hormone receptor (GnRH)
Type:
Enzyme
Mol. Mass.:
37749.45
Organism:
Homo sapiens (Human)
Description:
P30968
Residue:
328
  
Inhibitor
Name:
BDBM50215175
Synonyms:
(R)-1-(2,6-difluorobenzyl)-6-(4-chlorobenzyl)-3-(2-(dimethylamino)-2-phenylethyl)-5,6,7,8-tetrahydropyrido[4,3-d]pyrimidine-2,4(1H,3H)-dione | CHEMBL430171
Type:
Small organic molecule
Emp. Form.:
C31H31ClF2N4O2
Mol. Mass.:
565.053
SMILES:
CN(C)[C@@H](Cn1c(=O)c2CN(Cc3ccc(Cl)cc3)CCc2n(Cc2c(F)cccc2F)c1=O)c1ccccc1
: