Target
Gonadotropin-releasing hormone receptor
Ligand
BDBM50215208
Substrate
Meas. Tech.
ChEMBL_448200 (CHEMBL898460)
Ki
5±n/a nM
Citation
 Lanier, MCFeher, MAshweek, NJLoweth, CJRueter, JKSlee, DHWilliams, JPZhu, YFSullivan, SKBrown, MS Selection, synthesis, and structure-activity relationship of tetrahydropyrido[4,3-d]pyrimidine-2,4-diones as human GnRH receptor antagonists. Bioorg Med Chem 15:5590-603 (2007)  
Target
Name:
Gonadotropin-releasing hormone receptor
Synonyms:
GNRHR GRHR GnRH-R Gonadotropin-releasing hormone receptor | Gonadotropin-releasing hormone receptor (GnRH)
Type:
Enzyme
Mol. Mass.:
37749.45
Organism:
Homo sapiens (Human)
Description:
P30968
Residue:
328
  
Inhibitor
Name:
BDBM50215208
Synonyms:
6-(2,4-dimethylbenzyl)-1-(2,6-difluorobenzyl)-3-(2-(methyl(2-(pyridin-2-yl)ethyl)amino)ethyl)-5,6,7,8-tetrahydropyrido[4,3-d]pyrimidine-2,4(1H,3H)-dione | CHEMBL235270
Type:
Small organic molecule
Emp. Form.:
C33H37F2N5O2
Mol. Mass.:
573.676
SMILES:
CN(CCc1ccccn1)CCn1c(=O)c2CN(Cc3ccc(C)cc3C)CCc2n(Cc2c(F)cccc2F)c1=O
: