Target
Gonadotropin-releasing hormone receptor
Ligand
BDBM50215211
Substrate
Meas. Tech.
ChEMBL_448200 (CHEMBL898460)
Ki
30±n/a nM
Citation
 Lanier, MCFeher, MAshweek, NJLoweth, CJRueter, JKSlee, DHWilliams, JPZhu, YFSullivan, SKBrown, MS Selection, synthesis, and structure-activity relationship of tetrahydropyrido[4,3-d]pyrimidine-2,4-diones as human GnRH receptor antagonists. Bioorg Med Chem 15:5590-603 (2007)  
Target
Name:
Gonadotropin-releasing hormone receptor
Synonyms:
GNRHR GRHR GnRH-R Gonadotropin-releasing hormone receptor | Gonadotropin-releasing hormone receptor (GnRH)
Type:
Enzyme
Mol. Mass.:
37749.45
Organism:
Homo sapiens (Human)
Description:
P30968
Residue:
328
  
Inhibitor
Name:
BDBM50215211
Synonyms:
(R)-1-(2,6-difluorobenzyl)-6-(4-chlorobenzyl)-3-((1-(2-(pyridin-2-yl)ethyl)piperidin-2-yl)methyl)-5,6,7,8-tetrahydropyrido[4,3-d]pyrimidine-2,4(1H,3H)-dione | CHEMBL236142
Type:
Small organic molecule
Emp. Form.:
C34H36ClF2N5O2
Mol. Mass.:
620.132
SMILES:
Fc1cccc(F)c1Cn1c2CCN(Cc3ccc(Cl)cc3)Cc2c(=O)n(C[C@H]2CCCCN2CCc2ccccn2)c1=O
: