Target
Steryl-sulfatase
Ligand
BDBM50216096
Substrate
Meas. Tech.
ChEMBL_439850 (CHEMBL890173)
IC50
8000±n/a nM
Citation
 Jütten, PSchumann, WHärtl, ADahse, HMGräfe, U Thiosemicarbazones of formyl benzoic acids as novel potent inhibitors of estrone sulfatase. J Med Chem 50:3661-6 (2007)  
Target
Name:
Steryl-sulfatase
Synonyms:
ARSC1 Arylsulfatase C STS_HUMAN Steryl-sulfate sulfohydrolase
Type:
Enzyme
Mol. Mass.:
65503.66
Organism:
Homo sapiens (Human)
Description:
P08842
Residue:
583
  
Inhibitor
Name:
BDBM50216096
Synonyms:
2-(4-cyclohexylthiosemicarbazono)methyl-phenol | CHEMBL444886
Type:
Small organic molecule
Emp. Form.:
C14H19N3OS
Mol. Mass.:
277.385
SMILES:
Oc1ccccc1C=NNC(=S)NC1CCCCC1
: