Target
P2X purinoceptor 7
Ligand
BDBM50216403
Substrate
Meas. Tech.
ChEMBL_440099 (CHEMBL890410)
IC50
>1000±n/a nM
Citation
 Romagnoli, RBaraldi, PGCarrion, MDCara, CLPreti, DCruz-Lopez, OTabrizi, MAMoorman, ARGessi, SFogli, ESacchetto, VBorea, PA From tyrosine to glycine: synthesis and biological activity of potent antagonists of the purinergic P2X7 receptor. J Med Chem 50:3706-15 (2007)  
Target
Name:
P2X purinoceptor 7
Synonyms:
ATP receptor P2RX7_HUMAN P2X purinoceptor 7 (P2X7) P2Z receptor | Purinergic receptor
Type:
Protein
Mol. Mass.:
68602.85
Organism:
Homo sapiens (Human)
Description:
Q99572
Residue:
595
  
Inhibitor
Name:
BDBM50216403
Synonyms:
CHEMBL230295 isoquinolinesulfon-5-yl-[2-(4-phenylpiperazin-1-yl)-2-oxoethyl]amide
Type:
Small organic molecule
Emp. Form.:
C21H22N4O3S
Mol. Mass.:
410.489
SMILES:
O=C(CNS(=O)(=O)c1cccc2cnccc12)N1CCN(CC1)c1ccccc1
: