Target
Peroxisome proliferator-activated receptor alpha
Ligand
BDBM50216954
Substrate
Meas. Tech.
ChEMBL_456815 (CHEMBL924198)
EC50
10000±n/a nM
Target
Name:
Peroxisome proliferator-activated receptor alpha
Synonyms:
NR1C1 PPAR PPAR-alpha PPARA_HUMAN Peroxisome proliferator-activated receptor | Peroxisome proliferator-activated receptor alpha (PPAR alpha)
Type:
Enzyme
Mol. Mass.:
52222.08
Organism:
Homo sapiens (Human)
Description:
Q07869
Residue:
468
  
Inhibitor
Name:
BDBM50216954
Synonyms:
(S)-2-(5-(2-(2-phenyl-5-propyloxazol-4-yl)ethoxy)-2,3-dihydro-1H-inden-1-yl)acetic acid | CHEMBL398746
Type:
Small organic molecule
Emp. Form.:
C25H27NO4
Mol. Mass.:
405.4862
SMILES:
CCCc1oc(nc1CCOc1ccc2[C@H](CC(O)=O)CCc2c1)-c1ccccc1
: