Target
Peroxisome proliferator-activated receptor alpha
Ligand
BDBM50216967
Substrate
Meas. Tech.
ChEMBL_456815 (CHEMBL924198)
EC50
10000±n/a nM
Target
Name:
Peroxisome proliferator-activated receptor alpha
Synonyms:
NR1C1 PPAR PPAR-alpha PPARA_HUMAN Peroxisome proliferator-activated receptor | Peroxisome proliferator-activated receptor alpha (PPAR alpha)
Type:
Enzyme
Mol. Mass.:
52222.08
Organism:
Homo sapiens (Human)
Description:
Q07869
Residue:
468
  
Inhibitor
Name:
BDBM50216967
Synonyms:
CHEMBL428929 | {(S)-5-[2-(2-biphenyl-4-yl-1,5-dimethyl-1H-imidazol-4-yl)-ethoxy]-indan-1-yl}-acetic acid
Type:
Small organic molecule
Emp. Form.:
C30H30N2O3
Mol. Mass.:
466.5708
SMILES:
Cc1c(CCOc2ccc3[C@H](CC(O)=O)CCc3c2)nc(-c2ccc(cc2)-c2ccccc2)n1C
: