Target
Melanocyte-stimulating hormone receptor
Ligand
BDBM50217651
Substrate
Meas. Tech.
ChEMBL_448689 (CHEMBL896689)
Ki
14000±n/a nM
Citation
 Mutulis, FKreicberga, JYahorava, SMutule, IBorisova-Jan, LYahorau, AMuceniece, RAzena, SVeiksina, SPetrovska, RWikberg, JE Design and synthesis of a library of tertiary amides: evaluation as mimetics of the melanocortins' active core. Bioorg Med Chem 15:5787-810 (2007)  
Target
Name:
Melanocyte-stimulating hormone receptor
Synonyms:
MC1-R Mc1r Melanocyte-stimulating hormone receptor | Msh-r
Type:
PROTEIN
Mol. Mass.:
35238.60
Organism:
Mus musculus
Description:
ChEMBL_1498846
Residue:
315
  
Inhibitor
Name:
BDBM50217651
Synonyms:
CHEMBL393359 | N-(5-aminopentyl)-3-(1H-indol-3-yl)-N-(naphthalen-2-ylmethyl)propanamide
Type:
Small organic molecule
Emp. Form.:
C27H31N3O
Mol. Mass.:
413.5545
SMILES:
NCCCCCN(Cc1ccc2ccccc2c1)C(=O)CCc1c[nH]c2ccccc12
: