Target
Melanocortin receptor 5
Ligand
BDBM50217651
Substrate
Meas. Tech.
ChEMBL_448695 (CHEMBL897841)
Ki
7300±n/a nM
Citation
 Mutulis, FKreicberga, JYahorava, SMutule, IBorisova-Jan, LYahorau, AMuceniece, RAzena, SVeiksina, SPetrovska, RWikberg, JE Design and synthesis of a library of tertiary amides: evaluation as mimetics of the melanocortins' active core. Bioorg Med Chem 15:5787-810 (2007)  
Target
Name:
Melanocortin receptor 5
Synonyms:
MC-2 MC5R Melanocortin MC5 Melanocortin receptor 5 | Melanocortin receptor 5 (MC5R)
Type:
Enzyme
Mol. Mass.:
36612.92
Organism:
Homo sapiens (Human)
Description:
P33032
Residue:
325
  
Inhibitor
Name:
BDBM50217651
Synonyms:
CHEMBL393359 | N-(5-aminopentyl)-3-(1H-indol-3-yl)-N-(naphthalen-2-ylmethyl)propanamide
Type:
Small organic molecule
Emp. Form.:
C27H31N3O
Mol. Mass.:
413.5545
SMILES:
NCCCCCN(Cc1ccc2ccccc2c1)C(=O)CCc1c[nH]c2ccccc12
: