Target
Melanocortin receptor 4
Ligand
BDBM50217651
Substrate
Meas. Tech.
ChEMBL_448693 (CHEMBL897839)
Ki
62000±n/a nM
Citation
 Mutulis, FKreicberga, JYahorava, SMutule, IBorisova-Jan, LYahorau, AMuceniece, RAzena, SVeiksina, SPetrovska, RWikberg, JE Design and synthesis of a library of tertiary amides: evaluation as mimetics of the melanocortins' active core. Bioorg Med Chem 15:5787-810 (2007)  
Target
Name:
Melanocortin receptor 4
Synonyms:
MC4-R MC4R_HUMAN Melanocortin receptor 4 (MC-4) Melanocortin receptor 4 (MC4R)
Type:
Enzyme
Mol. Mass.:
36949.50
Organism:
Homo sapiens (Human)
Description:
P32245
Residue:
332
  
Inhibitor
Name:
BDBM50217651
Synonyms:
CHEMBL393359 | N-(5-aminopentyl)-3-(1H-indol-3-yl)-N-(naphthalen-2-ylmethyl)propanamide
Type:
Small organic molecule
Emp. Form.:
C27H31N3O
Mol. Mass.:
413.5545
SMILES:
NCCCCCN(Cc1ccc2ccccc2c1)C(=O)CCc1c[nH]c2ccccc12
: