Target
Thymidine kinase
Ligand
BDBM50217795
Substrate
Meas. Tech.
ChEMBL_444706 (CHEMBL894947)
IC50
493000±n/a nM
Citation
 Robins, MJNowak, IRajwanshi, VKMiranda, KCannon, JFPeterson, MAAndrei, GSnoeck, RDe Clercq, EBalzarini, J Synthesis and antiviral evaluation of 6-(alkyl-heteroaryl)furo[2,3-d]pyrimidin-2(3H)-one nucleosides and analogues with ethynyl, ethenyl, and ethyl spacers at C6 of the furopyrimidine core. J Med Chem 50:3897-905 (2007)  
Target
Name:
Thymidine kinase
Synonyms:
KITH_VZVD | TK
Type:
PROTEIN
Mol. Mass.:
37819.99
Organism:
Varicella-zoster virus (strain Dumas) (HHV-3) (Human herpesvirus 3)
Description:
ChEMBL_444706
Residue:
341
  
Inhibitor
Name:
BDBM50217795
Synonyms:
3-(2-deoxy-beta-d-erythro-pentofuranosyl)-6-(phenylethynyl)-furo[2,3-d]pyrimidin-2(3H)-one | CHEMBL243988
Type:
Small organic molecule
Emp. Form.:
C19H16N2O5
Mol. Mass.:
352.3407
SMILES:
OC[C@H]1O[C@H](C[C@@H]1O)n1cc2cc(oc2nc1=O)C#Cc1ccccc1
: