Target
Mu-type opioid receptor
Ligand
BDBM50217952
Substrate
Meas. Tech.
ChEMBL_444756 (CHEMBL895003)
Ki
0.190000±n/a nM
Citation
 Hiebel, ACLee, YSBilsky, EGiuvelis, DDeschamps, JRParrish, DAAceto, MDMay, ELHarris, LSCoop, ADersch, CMPartilla, JSRothman, RBCheng, KJacobson, AERice, KC Probes for narcotic receptor mediated phenomena. 34. Synthesis and structure-activity relationships of a potent mu-agonist delta-antagonist and an exceedingly potent antinociceptive in the enantiomeric C9-substituted 5-(3-hydroxyphenyl)-N-phenylethylmorphan series. J Med Chem 50:3765-76 (2007)  
Target
Name:
Mu-type opioid receptor
Synonyms:
M-OR-1 MOR-1 MUOR1 Mu opiate receptor OPRM1 hMOP | mu-type opioid receptor isoform MOR-1
Type:
G Protein-Coupled Receptor (GPCR)
Mol. Mass.:
44789.51
Organism:
Homo sapiens (Human)
Description:
P35372
Residue:
400
  
Inhibitor
Name:
BDBM50217952
Synonyms:
(1R,5R,9S)-(-)-9-hydroxy-5-(3-hydroxyphenyl-2-phenylethyl-2-azabicyclo[3.3.1]nonane | CHEMBL388873
Type:
Small organic molecule
Emp. Form.:
C22H27NO2
Mol. Mass.:
337.4553
SMILES:
O[C@@H]1[C@H]2CCC[C@@]1(CCN2CCc1ccccc1)c1cccc(O)c1
: