Target
Mu-type opioid receptor
Ligand
BDBM50217956
Substrate
Meas. Tech.
ChEMBL_444756 (CHEMBL895003)
Ki
0.190000±n/a nM
Citation
 Hiebel, ACLee, YSBilsky, EGiuvelis, DDeschamps, JRParrish, DAAceto, MDMay, ELHarris, LSCoop, ADersch, CMPartilla, JSRothman, RBCheng, KJacobson, AERice, KC Probes for narcotic receptor mediated phenomena. 34. Synthesis and structure-activity relationships of a potent mu-agonist delta-antagonist and an exceedingly potent antinociceptive in the enantiomeric C9-substituted 5-(3-hydroxyphenyl)-N-phenylethylmorphan series. J Med Chem 50:3765-76 (2007)  
Target
Name:
Mu-type opioid receptor
Synonyms:
M-OR-1 MOR-1 MUOR1 Mu opiate receptor OPRM1 hMOP | mu-type opioid receptor isoform MOR-1
Type:
G Protein-Coupled Receptor (GPCR)
Mol. Mass.:
44789.51
Organism:
Homo sapiens (Human)
Description:
P35372
Residue:
400
  
Inhibitor
Name:
BDBM50217956
Synonyms:
(1R,5S)-(+)-5-(3-hydroxyphenyl)-9-methylene-2-phenethyl-2-azabicyclo[3.3.1]nonane | CHEMBL242226
Type:
Small organic molecule
Emp. Form.:
C23H27NO
Mol. Mass.:
333.4666
SMILES:
Oc1cccc(c1)[C@]12CCC[C@@H](N(CCc3ccccc3)CC1)C2=C
: