Target
Alpha-2A adrenergic receptor
Ligand
BDBM50002903
Substrate
Meas. Tech.
ChEMBL_444826 (CHEMBL895077)
Ki
15±n/a nM
Citation
 Crassous, PACardinaletti, CCarrieri, ABruni, BDi Vaira, MGentili, FGhelfi, FGiannella, MParis, HPiergentili, AQuaglia, WSchaak, SVesprini, CPigini, M Alpha2-adrenoreceptors profile modulation. 3.1 (R)-(+)-m-nitrobiphenyline, a new efficient and alpha2C-subtype selective agonist. J Med Chem 50:3964-8 (2007)  
Target
Name:
Alpha-2A adrenergic receptor
Synonyms:
ADA2A_HUMAN ADRA2R Adrenergic alpha2A Alpha-2 adrenergic receptor subtype C10 Alpha-2A adrenoreceptor alpha-2A adrenergic receptor [Homo sapiens]
Type:
Enzyme
Mol. Mass.:
48979.91
Organism:
Homo sapiens (Human)
Description:
P08913
Residue:
465
  
Inhibitor
Name:
BDBM50002903
Synonyms:
CHEMBL223836
Type:
Small organic molecule
Emp. Form.:
C17H17FN2O
Mol. Mass.:
284.3281
SMILES:
CC(Oc1ccccc1-c1cccc(F)c1)C1=NCCN1
: