Target
Tyrosine-protein phosphatase non-receptor type 1
Ligand
BDBM50219573
Substrate
Meas. Tech.
ChEMBL_445832 (CHEMBL896126)
Ki
36±n/a nM
Citation
 Wilson, DPWan, ZKXu, WXKirincich, SJFollows, BCJoseph-McCarthy, DForeman, KMoretto, AWu, JZhu, MBinnun, EZhang, YLTam, MErbe, DVTobin, JXu, XLeung, LShilling, ATam, SYMansour, TSLee, J Structure-based optimization of protein tyrosine phosphatase 1B inhibitors: from the active site to the second phosphotyrosine binding site. J Med Chem 50:4681-98 (2007)  
Target
Name:
Tyrosine-protein phosphatase non-receptor type 1
Synonyms:
PTN1_HUMAN PTPN1 Protein tyrosine phosphatase-1B (PTP1B) Protein-tyrosine phosphatase 1B (PTP1B) Tyrosine-protein phosphatase non-receptor type 1 (PTP1B)
Type:
Protein phosphatase
Mol. Mass.:
49963.76
Organism:
Homo sapiens (Human)
Description:
Human recombinant GST-fusion PTP1B (1-435).
Residue:
435
  
Inhibitor
Name:
BDBM50219573
Synonyms:
4-BROMO-3-(CARBOXYMETHOXY)-5-{3-[(3,3,5,5-TETRAMETHYLCYCLOHEXYL)AMINO]PHENYL}THIOPHENE-2-CARBOXYLIC ACID 4-bromo-3-carboxymethoxy-5-[3-(3,3,5,5-tetramethylcyclohexylamino)phenyl]thiophene-2-carboxylic acid | CHEMBL243942
Type:
Small organic molecule
Emp. Form.:
C23H28BrNO5S
Mol. Mass.:
510.441
SMILES:
CC1(C)CC(CC(C)(C)C1)Nc1cccc(c1)-c1sc(C(O)=O)c(OCC(O)=O)c1Br
: