Target
Tyrosine-protein phosphatase non-receptor type 2
Ligand
BDBM50219585
Substrate
Meas. Tech.
ChEMBL_445833 (CHEMBL896127)
Ki
5±n/a nM
Citation
 Wilson, DPWan, ZKXu, WXKirincich, SJFollows, BCJoseph-McCarthy, DForeman, KMoretto, AWu, JZhu, MBinnun, EZhang, YLTam, MErbe, DVTobin, JXu, XLeung, LShilling, ATam, SYMansour, TSLee, J Structure-based optimization of protein tyrosine phosphatase 1B inhibitors: from the active site to the second phosphotyrosine binding site. J Med Chem 50:4681-98 (2007)  
Target
Name:
Tyrosine-protein phosphatase non-receptor type 2
Synonyms:
PTN2_HUMAN PTPT T-cell protein-tyrosine phosphatase TCPTP Tyrosine-protein phosphatase non-receptor type 2 (TC-PTP)
Type:
Protein
Mol. Mass.:
48481.80
Organism:
Homo sapiens (Human)
Description:
P17706
Residue:
415
  
Inhibitor
Name:
BDBM50219585
Synonyms:
4-bromo-3-carboxymethoxy-5-(3-{[1-(2-methoxyphenylcarbamoyl)piperidin-4-ylmethyl]amino}phenyl)thiophene-2-carboxylic acid | CHEMBL243267
Type:
Small organic molecule
Emp. Form.:
C27H28BrN3O7S
Mol. Mass.:
618.496
SMILES:
COc1ccccc1NC(=O)N1CCC(CNc2cccc(c2)-c2sc(C(O)=O)c(OCC(O)=O)c2Br)CC1
: