Target
Tyrosine-protein phosphatase non-receptor type 2
Ligand
BDBM50219586
Substrate
Meas. Tech.
ChEMBL_445833 (CHEMBL896127)
Ki
2±n/a nM
Citation
 Wilson, DPWan, ZKXu, WXKirincich, SJFollows, BCJoseph-McCarthy, DForeman, KMoretto, AWu, JZhu, MBinnun, EZhang, YLTam, MErbe, DVTobin, JXu, XLeung, LShilling, ATam, SYMansour, TSLee, J Structure-based optimization of protein tyrosine phosphatase 1B inhibitors: from the active site to the second phosphotyrosine binding site. J Med Chem 50:4681-98 (2007)  
Target
Name:
Tyrosine-protein phosphatase non-receptor type 2
Synonyms:
PTN2_HUMAN PTPT T-cell protein-tyrosine phosphatase TCPTP Tyrosine-protein phosphatase non-receptor type 2 (TC-PTP)
Type:
Protein
Mol. Mass.:
48481.80
Organism:
Homo sapiens (Human)
Description:
P17706
Residue:
415
  
Inhibitor
Name:
BDBM50219586
Synonyms:
4-bromo-3-(carboxymethoxy)-5-{3-[(1-{[2-(trifluoromethyl)-benzyl]sulfonyl}piperidin-4-yl)amino]phenyl}thiophene-2-carboxylic acid | CHEMBL230751
Type:
Small organic molecule
Emp. Form.:
C26H24BrF3N2O7S2
Mol. Mass.:
677.507
SMILES:
OC(=O)COc1c(Br)c(sc1C(O)=O)-c1cccc(NC2CCN(CC2)S(=O)(=O)Cc2ccccc2C(F)(F)F)c1
: