Target
Thrombopoietin receptor
Ligand
BDBM50219613
Substrate
Meas. Tech.
ChEMBL_457234 (CHEMBL941720)
EC50
9±n/a nM
Citation
 Reiter, LASubramanyam, CMangual, EJJones, CSSmeets, MIBrissette, WHMcCurdy, SPLira, PDLinde, RGLi, QZhang, FAntipas, ASBlumberg, LCDoty, JLDriscoll, JPMunchhof, MJRipp, SLShavnya, AShepard, RMSperger, DThomasco, LMTrevena, KAWolf-Gouveia, LAZhang, L Pyrimidine benzamide-based thrombopoietin receptor agonists. Bioorg Med Chem Lett 17:5447-54 (2007)  
Target
Name:
Thrombopoietin receptor
Synonyms:
C-mpl MPL TPO-R TPOR_HUMAN
Type:
PROTEIN
Mol. Mass.:
71243.48
Organism:
Homo sapiens (Human)
Description:
ChEMBL_535587
Residue:
635
  
Inhibitor
Name:
BDBM50219613
Synonyms:
CHEMBL248218 | N-(4-(2-fluoro-3-(trifluoromethyl)phenyl)thiazol-2-yl)-4-(6-(3-hydroxyazetidin-1-yl)pyrimidin-4-ylamino)benzamide
Type:
Small organic molecule
Emp. Form.:
C24H18F4N6O2S
Mol. Mass.:
530.497
SMILES:
OC1CN(C1)c1cc(Nc2ccc(cc2)C(=O)Nc2nc(cs2)-c2cccc(c2F)C(F)(F)F)ncn1
: