Target
Thrombopoietin receptor
Ligand
BDBM50219614
Substrate
Meas. Tech.
ChEMBL_457234 (CHEMBL941720)
EC50
29±n/a nM
Citation
 Reiter, LASubramanyam, CMangual, EJJones, CSSmeets, MIBrissette, WHMcCurdy, SPLira, PDLinde, RGLi, QZhang, FAntipas, ASBlumberg, LCDoty, JLDriscoll, JPMunchhof, MJRipp, SLShavnya, AShepard, RMSperger, DThomasco, LMTrevena, KAWolf-Gouveia, LAZhang, L Pyrimidine benzamide-based thrombopoietin receptor agonists. Bioorg Med Chem Lett 17:5447-54 (2007)  
Target
Name:
Thrombopoietin receptor
Synonyms:
C-mpl MPL TPO-R TPOR_HUMAN
Type:
PROTEIN
Mol. Mass.:
71243.48
Organism:
Homo sapiens (Human)
Description:
ChEMBL_535587
Residue:
635
  
Inhibitor
Name:
BDBM50219614
Synonyms:
CHEMBL249672 | N-(3-(4-fluoro-3-(trifluoromethyl)phenyl)-1,2,4-thiadiazol-5-yl)-4-(6-((2-hydroxy-1-(hydroxyamino)ethyl)(methyl)amino)pyrimidin-4-ylamino)benzamide
Type:
Small organic molecule
Emp. Form.:
C23H20F4N8O3S
Mol. Mass.:
564.515
SMILES:
CN(C(CO)NO)c1cc(Nc2ccc(cc2)C(=O)Nc2nc(ns2)-c2ccc(F)c(c2)C(F)(F)F)ncn1
: