Target
Thrombopoietin receptor
Ligand
BDBM50219611
Substrate
Meas. Tech.
ChEMBL_457234 (CHEMBL941720)
EC50
540±n/a nM
Citation
 Reiter, LASubramanyam, CMangual, EJJones, CSSmeets, MIBrissette, WHMcCurdy, SPLira, PDLinde, RGLi, QZhang, FAntipas, ASBlumberg, LCDoty, JLDriscoll, JPMunchhof, MJRipp, SLShavnya, AShepard, RMSperger, DThomasco, LMTrevena, KAWolf-Gouveia, LAZhang, L Pyrimidine benzamide-based thrombopoietin receptor agonists. Bioorg Med Chem Lett 17:5447-54 (2007)  
Target
Name:
Thrombopoietin receptor
Synonyms:
C-mpl MPL TPO-R TPOR_HUMAN
Type:
PROTEIN
Mol. Mass.:
71243.48
Organism:
Homo sapiens (Human)
Description:
ChEMBL_535587
Residue:
635
  
Inhibitor
Name:
BDBM50219611
Synonyms:
4-(1,3,5-triazin-2-ylamino)-N-(4-(2-fluoro-3-(trifluoromethyl)phenyl)thiazol-2-yl)benzamide | CHEMBL248039
Type:
Small organic molecule
Emp. Form.:
C20H12F4N6OS
Mol. Mass.:
460.407
SMILES:
Fc1c(cccc1C(F)(F)F)-c1csc(NC(=O)c2ccc(Nc3ncncn3)cc2)n1
: