Target
Thrombopoietin receptor
Ligand
BDBM50219615
Substrate
Meas. Tech.
ChEMBL_457234 (CHEMBL941720)
EC50
>10000±n/a nM
Citation
 Reiter, LASubramanyam, CMangual, EJJones, CSSmeets, MIBrissette, WHMcCurdy, SPLira, PDLinde, RGLi, QZhang, FAntipas, ASBlumberg, LCDoty, JLDriscoll, JPMunchhof, MJRipp, SLShavnya, AShepard, RMSperger, DThomasco, LMTrevena, KAWolf-Gouveia, LAZhang, L Pyrimidine benzamide-based thrombopoietin receptor agonists. Bioorg Med Chem Lett 17:5447-54 (2007)  
Target
Name:
Thrombopoietin receptor
Synonyms:
C-mpl MPL TPO-R TPOR_HUMAN
Type:
PROTEIN
Mol. Mass.:
71243.48
Organism:
Homo sapiens (Human)
Description:
ChEMBL_535587
Residue:
635
  
Inhibitor
Name:
BDBM50219615
Synonyms:
CHEMBL247650 | N-(4-(2-fluoro-3-(trifluoromethyl)phenyl)thiazol-2-yl)-4-(phenylamino)benzamide
Type:
Small organic molecule
Emp. Form.:
C23H15F4N3OS
Mol. Mass.:
457.443
SMILES:
Fc1c(cccc1C(F)(F)F)-c1csc(NC(=O)c2ccc(Nc3ccccc3)cc2)n1
: