Target
Thrombopoietin receptor
Ligand
BDBM50219618
Substrate
Meas. Tech.
ChEMBL_457234 (CHEMBL941720)
EC50
1400±n/a nM
Citation
 Reiter, LASubramanyam, CMangual, EJJones, CSSmeets, MIBrissette, WHMcCurdy, SPLira, PDLinde, RGLi, QZhang, FAntipas, ASBlumberg, LCDoty, JLDriscoll, JPMunchhof, MJRipp, SLShavnya, AShepard, RMSperger, DThomasco, LMTrevena, KAWolf-Gouveia, LAZhang, L Pyrimidine benzamide-based thrombopoietin receptor agonists. Bioorg Med Chem Lett 17:5447-54 (2007)  
Target
Name:
Thrombopoietin receptor
Synonyms:
C-mpl MPL TPO-R TPOR_HUMAN
Type:
PROTEIN
Mol. Mass.:
71243.48
Organism:
Homo sapiens (Human)
Description:
ChEMBL_535587
Residue:
635
  
Inhibitor
Name:
BDBM50219618
Synonyms:
CHEMBL399768 | N-(1-(2-fluoro-3-(trifluoromethyl)phenyl)-1H-pyrazol-3-yl)-4-(pyrimidin-4-ylamino)benzamide
Type:
Small organic molecule
Emp. Form.:
C21H14F4N6O
Mol. Mass.:
442.3691
SMILES:
Fc1c(cccc1C(F)(F)F)-n1ccc(NC(=O)c2ccc(Nc3ccncn3)cc2)n1
: