Target
Thrombopoietin receptor
Ligand
BDBM50219623
Substrate
Meas. Tech.
ChEMBL_457234 (CHEMBL941720)
EC50
1600±n/a nM
Citation
 Reiter, LASubramanyam, CMangual, EJJones, CSSmeets, MIBrissette, WHMcCurdy, SPLira, PDLinde, RGLi, QZhang, FAntipas, ASBlumberg, LCDoty, JLDriscoll, JPMunchhof, MJRipp, SLShavnya, AShepard, RMSperger, DThomasco, LMTrevena, KAWolf-Gouveia, LAZhang, L Pyrimidine benzamide-based thrombopoietin receptor agonists. Bioorg Med Chem Lett 17:5447-54 (2007)  
Target
Name:
Thrombopoietin receptor
Synonyms:
C-mpl MPL TPO-R TPOR_HUMAN
Type:
PROTEIN
Mol. Mass.:
71243.48
Organism:
Homo sapiens (Human)
Description:
ChEMBL_535587
Residue:
635
  
Inhibitor
Name:
BDBM50219623
Synonyms:
CHEMBL247198 | N-(3-phenyl-1,2,4-thiadiazol-5-yl)-4-(pyrimidin-4-ylamino)benzamide
Type:
Small organic molecule
Emp. Form.:
C19H14N6OS
Mol. Mass.:
374.419
SMILES:
O=C(Nc1nc(ns1)-c1ccccc1)c1ccc(Nc2ccncn2)cc1
: