Target
Thrombopoietin receptor
Ligand
BDBM50219628
Substrate
Meas. Tech.
ChEMBL_457234 (CHEMBL941720)
EC50
>10000±n/a nM
Citation
 Reiter, LASubramanyam, CMangual, EJJones, CSSmeets, MIBrissette, WHMcCurdy, SPLira, PDLinde, RGLi, QZhang, FAntipas, ASBlumberg, LCDoty, JLDriscoll, JPMunchhof, MJRipp, SLShavnya, AShepard, RMSperger, DThomasco, LMTrevena, KAWolf-Gouveia, LAZhang, L Pyrimidine benzamide-based thrombopoietin receptor agonists. Bioorg Med Chem Lett 17:5447-54 (2007)  
Target
Name:
Thrombopoietin receptor
Synonyms:
C-mpl MPL TPO-R TPOR_HUMAN
Type:
PROTEIN
Mol. Mass.:
71243.48
Organism:
Homo sapiens (Human)
Description:
ChEMBL_535587
Residue:
635
  
Inhibitor
Name:
BDBM50219628
Synonyms:
4-(2,6-dimethylpyrimidin-4-ylamino)-N-(4-(2-fluoro-3-(trifluoromethyl)phenyl)thiazol-2-yl)benzamide | CHEMBL246846
Type:
Small organic molecule
Emp. Form.:
C23H17F4N5OS
Mol. Mass.:
487.473
SMILES:
Cc1cc(Nc2ccc(cc2)C(=O)Nc2nc(cs2)-c2cccc(c2F)C(F)(F)F)nc(C)n1
: