Target
Thrombopoietin receptor
Ligand
BDBM50219634
Substrate
Meas. Tech.
ChEMBL_457234 (CHEMBL941720)
EC50
81±n/a nM
Citation
 Reiter, LASubramanyam, CMangual, EJJones, CSSmeets, MIBrissette, WHMcCurdy, SPLira, PDLinde, RGLi, QZhang, FAntipas, ASBlumberg, LCDoty, JLDriscoll, JPMunchhof, MJRipp, SLShavnya, AShepard, RMSperger, DThomasco, LMTrevena, KAWolf-Gouveia, LAZhang, L Pyrimidine benzamide-based thrombopoietin receptor agonists. Bioorg Med Chem Lett 17:5447-54 (2007)  
Target
Name:
Thrombopoietin receptor
Synonyms:
C-mpl MPL TPO-R TPOR_HUMAN
Type:
PROTEIN
Mol. Mass.:
71243.48
Organism:
Homo sapiens (Human)
Description:
ChEMBL_535587
Residue:
635
  
Inhibitor
Name:
BDBM50219634
Synonyms:
4-(6-(azetidin-1-yl)pyrimidin-4-ylamino)-N-(3-(4-fluoro-3-(trifluoromethyl)phenyl)-1,2,4-thiadiazol-5-yl)benzamide | CHEMBL246429
Type:
Small organic molecule
Emp. Form.:
C23H17F4N7OS
Mol. Mass.:
515.486
SMILES:
Fc1ccc(cc1C(F)(F)F)-c1nsc(NC(=O)c2ccc(Nc3cc(ncn3)N3CCC3)cc2)n1
: