Target
Thrombopoietin receptor
Ligand
BDBM50219637
Substrate
Meas. Tech.
ChEMBL_457234 (CHEMBL941720)
EC50
>10000±n/a nM
Citation
 Reiter, LASubramanyam, CMangual, EJJones, CSSmeets, MIBrissette, WHMcCurdy, SPLira, PDLinde, RGLi, QZhang, FAntipas, ASBlumberg, LCDoty, JLDriscoll, JPMunchhof, MJRipp, SLShavnya, AShepard, RMSperger, DThomasco, LMTrevena, KAWolf-Gouveia, LAZhang, L Pyrimidine benzamide-based thrombopoietin receptor agonists. Bioorg Med Chem Lett 17:5447-54 (2007)  
Target
Name:
Thrombopoietin receptor
Synonyms:
C-mpl MPL TPO-R TPOR_HUMAN
Type:
PROTEIN
Mol. Mass.:
71243.48
Organism:
Homo sapiens (Human)
Description:
ChEMBL_535587
Residue:
635
  
Inhibitor
Name:
BDBM50219637
Synonyms:
4-(pyrimidin-4-ylamino)-N-(3-(3-(trifluoromethoxy)phenyl)-1,2,4-thiadiazol-5-yl)benzamide | CHEMBL439406
Type:
Small organic molecule
Emp. Form.:
C20H13F3N6O2S
Mol. Mass.:
458.416
SMILES:
FC(F)(F)Oc1cccc(c1)-c1nsc(NC(=O)c2ccc(Nc3ccncn3)cc2)n1
: