Target
Thrombopoietin receptor
Ligand
BDBM50219639
Substrate
Meas. Tech.
ChEMBL_457234 (CHEMBL941720)
EC50
347±n/a nM
Citation
 Reiter, LASubramanyam, CMangual, EJJones, CSSmeets, MIBrissette, WHMcCurdy, SPLira, PDLinde, RGLi, QZhang, FAntipas, ASBlumberg, LCDoty, JLDriscoll, JPMunchhof, MJRipp, SLShavnya, AShepard, RMSperger, DThomasco, LMTrevena, KAWolf-Gouveia, LAZhang, L Pyrimidine benzamide-based thrombopoietin receptor agonists. Bioorg Med Chem Lett 17:5447-54 (2007)  
Target
Name:
Thrombopoietin receptor
Synonyms:
C-mpl MPL TPO-R TPOR_HUMAN
Type:
PROTEIN
Mol. Mass.:
71243.48
Organism:
Homo sapiens (Human)
Description:
ChEMBL_535587
Residue:
635
  
Inhibitor
Name:
BDBM50219639
Synonyms:
CHEMBL391597 | N-(4-(3,4-dichlorophenyl)thiazol-2-yl)-4-(pyrimidin-4-ylamino)benzamide
Type:
Small organic molecule
Emp. Form.:
C20H13Cl2N5OS
Mol. Mass.:
442.321
SMILES:
Clc1ccc(cc1Cl)-c1csc(NC(=O)c2ccc(Nc3ccncn3)cc2)n1
: