Target
Thrombopoietin receptor
Ligand
BDBM50219621
Substrate
Meas. Tech.
ChEMBL_457234 (CHEMBL941720)
EC50
27±n/a nM
Citation
 Reiter, LASubramanyam, CMangual, EJJones, CSSmeets, MIBrissette, WHMcCurdy, SPLira, PDLinde, RGLi, QZhang, FAntipas, ASBlumberg, LCDoty, JLDriscoll, JPMunchhof, MJRipp, SLShavnya, AShepard, RMSperger, DThomasco, LMTrevena, KAWolf-Gouveia, LAZhang, L Pyrimidine benzamide-based thrombopoietin receptor agonists. Bioorg Med Chem Lett 17:5447-54 (2007)  
Target
Name:
Thrombopoietin receptor
Synonyms:
C-mpl MPL TPO-R TPOR_HUMAN
Type:
PROTEIN
Mol. Mass.:
71243.48
Organism:
Homo sapiens (Human)
Description:
ChEMBL_535587
Residue:
635
  
Inhibitor
Name:
BDBM50219621
Synonyms:
4-(pyrimidin-4-ylamino)-N-(7-trifluoromethyl-4,5-dihydro-6-oxa-3-thia-1-aza-benzo[e]azulen-2-yl)-benzamide | CHEMBL245795
Type:
Small organic molecule
Emp. Form.:
C23H16F3N5O2S
Mol. Mass.:
483.466
SMILES:
FC(F)(F)c1cccc2-c3nc(NC(=O)c4ccc(Nc5ccncn5)cc4)sc3CCOc12
: