Target
Thrombopoietin receptor
Ligand
BDBM50219649
Substrate
Meas. Tech.
ChEMBL_457234 (CHEMBL941720)
EC50
>10000±n/a nM
Citation
 Reiter, LASubramanyam, CMangual, EJJones, CSSmeets, MIBrissette, WHMcCurdy, SPLira, PDLinde, RGLi, QZhang, FAntipas, ASBlumberg, LCDoty, JLDriscoll, JPMunchhof, MJRipp, SLShavnya, AShepard, RMSperger, DThomasco, LMTrevena, KAWolf-Gouveia, LAZhang, L Pyrimidine benzamide-based thrombopoietin receptor agonists. Bioorg Med Chem Lett 17:5447-54 (2007)  
Target
Name:
Thrombopoietin receptor
Synonyms:
C-mpl MPL TPO-R TPOR_HUMAN
Type:
PROTEIN
Mol. Mass.:
71243.48
Organism:
Homo sapiens (Human)
Description:
ChEMBL_535587
Residue:
635
  
Inhibitor
Name:
BDBM50219649
Synonyms:
CHEMBL397519 | N-(4-(2,6-dichloro-4-(trifluoromethyl)phenyl)thiazol-2-yl)-4-(pyrimidin-4-ylamino)benzamide
Type:
Small organic molecule
Emp. Form.:
C21H12Cl2F3N5OS
Mol. Mass.:
510.319
SMILES:
FC(F)(F)c1cc(Cl)c(-c2csc(NC(=O)c3ccc(Nc4ccncn4)cc3)n2)c(Cl)c1
: