Target
Thrombopoietin receptor
Ligand
BDBM50219644
Substrate
Meas. Tech.
ChEMBL_457234 (CHEMBL941720)
EC50
11±n/a nM
Citation
 Reiter, LASubramanyam, CMangual, EJJones, CSSmeets, MIBrissette, WHMcCurdy, SPLira, PDLinde, RGLi, QZhang, FAntipas, ASBlumberg, LCDoty, JLDriscoll, JPMunchhof, MJRipp, SLShavnya, AShepard, RMSperger, DThomasco, LMTrevena, KAWolf-Gouveia, LAZhang, L Pyrimidine benzamide-based thrombopoietin receptor agonists. Bioorg Med Chem Lett 17:5447-54 (2007)  
Target
Name:
Thrombopoietin receptor
Synonyms:
C-mpl MPL TPO-R TPOR_HUMAN
Type:
PROTEIN
Mol. Mass.:
71243.48
Organism:
Homo sapiens (Human)
Description:
ChEMBL_535587
Residue:
635
  
Inhibitor
Name:
BDBM50219644
Synonyms:
CHEMBL248390 | N-(5-chloro-4-(4-fluoro-3-(trifluoromethyl)phenyl)thiazol-2-yl)-4-(6-(dimethylamino)pyrimidin-4-ylamino)benzamide
Type:
Small organic molecule
Emp. Form.:
C23H17ClF4N6OS
Mol. Mass.:
536.932
SMILES:
CN(C)c1cc(Nc2ccc(cc2)C(=O)Nc2nc(c(Cl)s2)-c2ccc(F)c(c2)C(F)(F)F)ncn1
: