Target
Thrombopoietin receptor
Ligand
BDBM50219718
Substrate
Meas. Tech.
ChEMBL_457234 (CHEMBL941720)
EC50
7900±n/a nM
Citation
 Reiter, LASubramanyam, CMangual, EJJones, CSSmeets, MIBrissette, WHMcCurdy, SPLira, PDLinde, RGLi, QZhang, FAntipas, ASBlumberg, LCDoty, JLDriscoll, JPMunchhof, MJRipp, SLShavnya, AShepard, RMSperger, DThomasco, LMTrevena, KAWolf-Gouveia, LAZhang, L Pyrimidine benzamide-based thrombopoietin receptor agonists. Bioorg Med Chem Lett 17:5447-54 (2007)  
Target
Name:
Thrombopoietin receptor
Synonyms:
C-mpl MPL TPO-R TPOR_HUMAN
Type:
PROTEIN
Mol. Mass.:
71243.48
Organism:
Homo sapiens (Human)
Description:
ChEMBL_535587
Residue:
635
  
Inhibitor
Name:
BDBM50219718
Synonyms:
CHEMBL248426 | N-(2-(2-fluoro-3-(trifluoromethyl)phenyl)oxazol-4-yl)-4-(pyrimidin-4-ylamino)benzamide
Type:
Small organic molecule
Emp. Form.:
C21H13F4N5O2
Mol. Mass.:
443.3538
SMILES:
Fc1c(cccc1C(F)(F)F)-c1nc(NC(=O)c2ccc(Nc3ccncn3)cc2)co1
: