Target
Metabotropic glutamate receptor 7
Ligand
BDBM50220011
Substrate
Meas. Tech.
ChEMBL_445956 (CHEMBL896249)
EC50
197000±n/a nM
Citation
 Selvam, CGoudet, COueslati, NPin, JPAcher, FC L-(+)-2-Amino-4-thiophosphonobutyric acid (L-thioAP4), a new potent agonist of group III metabotropic glutamate receptors: increased distal acidity affords enhanced potency. J Med Chem 50:4656-64 (2007)  
Target
Name:
Metabotropic glutamate receptor 7
Synonyms:
GRM7_RAT Grm7 Metabotropic glutamate receptor 7 (mGlu7) mGlu7
Type:
Enzyme
Mol. Mass.:
102244.48
Organism:
Rattus norvegicus (Rat)
Description:
P35400
Residue:
915
  
Inhibitor
Name:
BDBM50220011
Synonyms:
CHEMBL243925 | L-(+)-2-amino-4-thiophosphonobutyric acid
Type:
Small organic molecule
Emp. Form.:
C4H10NO4PS
Mol. Mass.:
199.165
SMILES:
N[C@@H](CCP(O)(O)=S)C(O)=O
: