Target
Metabotropic glutamate receptor 6
Ligand
BDBM50220011
Substrate
Meas. Tech.
ChEMBL_445955 (CHEMBL896248)
EC50
730±n/a nM
Citation
 Selvam, CGoudet, COueslati, NPin, JPAcher, FC L-(+)-2-Amino-4-thiophosphonobutyric acid (L-thioAP4), a new potent agonist of group III metabotropic glutamate receptors: increased distal acidity affords enhanced potency. J Med Chem 50:4656-64 (2007)  
Target
Name:
Metabotropic glutamate receptor 6
Synonyms:
GRM6_RAT Grm6 Metabotropic glutamate receptor 6 (mGlu6) mGlu6 | metabotropic glutamate 6
Type:
Enzyme
Mol. Mass.:
95095.82
Organism:
Rattus norvegicus (Rat)
Description:
P35349
Residue:
871
  
Inhibitor
Name:
BDBM50220011
Synonyms:
CHEMBL243925 | L-(+)-2-amino-4-thiophosphonobutyric acid
Type:
Small organic molecule
Emp. Form.:
C4H10NO4PS
Mol. Mass.:
199.165
SMILES:
N[C@@H](CCP(O)(O)=S)C(O)=O
: