Target
Metabotropic glutamate receptor 5
Ligand
BDBM50220091
Substrate
Meas. Tech.
ChEMBL_449073 (CHEMBL899333)
IC50
>30000±n/a nM
Citation
 Wendt, JADeeter, SDBove, SEKnauer, CSBrooker, RMAugelli-Szafran, CESchwarz, RDKinsora, JJKilgore, KS Synthesis and SAR of 2-aryl pyrido[2,3-d]pyrimidines as potent mGlu5 receptor antagonists. Bioorg Med Chem Lett 17:5396-9 (2007)  
Target
Name:
Metabotropic glutamate receptor 5
Synonyms:
GRM5_RAT Grm5 Mglur5 metabotropic glutamate 5/1-C metabotropic glutamate 5a
Type:
Enzyme
Mol. Mass.:
131900.14
Organism:
Rattus norvegicus (Rat)
Description:
P31424
Residue:
1203
  
Inhibitor
Name:
BDBM50220091
Synonyms:
2-(2,4-dichlorophenyl)-7-methylpyrido[2,3-d]pyrimidine | CHEMBL239621
Type:
Small organic molecule
Emp. Form.:
C14H9Cl2N3
Mol. Mass.:
290.147
SMILES:
Cc1ccc2cnc(nc2n1)-c1ccc(Cl)cc1Cl
: