Target
Kinesin-like protein KIF11
Ligand
BDBM50220330
Substrate
Meas. Tech.
ChEMBL_449205 (CHEMBL898408)
IC50
1.4±n/a nM
Citation
 Coleman, PJSchreier, JDCox, CDFraley, MEGarbaccio, RMBuser, CAWalsh, ESHamilton, KLobell, RBRickert, KTao, WDiehl, RESouth, VJDavide, JPKohl, NEYan, YKuo, LPrueksaritanont, TLi, CMahan, EAFernandez-Metzler, CSalata, JJHartman, GD Kinesin spindle protein (KSP) inhibitors. Part 6: Design and synthesis of 3,5-diaryl-4,5-dihydropyrazole amides as potent inhibitors of the mitotic kinesin KSP. Bioorg Med Chem Lett 17:5390-5 (2007)  
Target
Name:
Kinesin-like protein KIF11
Synonyms:
EG5 KIF11_HUMAN Kinesin Spindle Protein Eg5 TRIP5 | kinesin spindle protein
Type:
PROTEIN
Mol. Mass.:
119138.97
Organism:
Homo sapiens (Human)
Description:
ChEMBL_1457426
Residue:
1056
  
Inhibitor
Name:
BDBM50220330
Synonyms:
(S)-1-(3-(2,5-difluorophenyl)-5-(3-(dimethylamino)propyl)-5-phenyl-4,5-dihydropyrazol-1-yl)ethanone | CHEMBL392148
Type:
Small organic molecule
Emp. Form.:
C22H25F2N3O
Mol. Mass.:
385.4502
SMILES:
CN(C)CCC[C@]1(CC(=NN1C(C)=O)c1cc(F)ccc1F)c1ccccc1
: